Status of 0.7.11

Subject: Status of 0.7.11
Date: Wed Aug 30 2000 - 16:02:35 CDT

Ok, we tried again to run builds again, and the Solaris box is failing here:

In file included from ut_mbtowc.cpp:23:
ut_mbtowc.h:15: syntax error before `;'
ut_mbtowc.cpp: In method `void UT_Mbtowc::initialize()':
ut_mbtowc.cpp:32: `m_state' undeclared (first use this function)
ut_mbtowc.cpp:32: (Each undeclared identifier is reported only once
ut_mbtowc.cpp:32: for each function it appears in.)
ut_mbtowc.cpp: In method `int UT_Mbtowc::mbtowc(__wchar_t &, char)':
ut_mbtowc.cpp:57: `mbrtowc' undeclared (first use this function)
make[5]: *** [/space/builds/0967667972/tmp/abi-0.7.11pre9/src/SunOS_5.5.1_sparc32_OBJ/obj/ut_mbtowc.o] Error 1
make[5]: Leaving directory `/space/builds/0967667972/tmp/abi-0.7.11pre9/src/af/util/xp'
make[4]: *** [build] Error 2
make[4]: Leaving directory `/space/builds/0967667972/tmp/abi-0.7.11pre9/src/af/util'
make[3]: *** [build] Error 2
make[3]: Leaving directory `/space/builds/0967667972/tmp/abi-0.7.11pre9/src/af'
make[2]: *** [build] Error 2
make[2]: Leaving directory `/space/builds/0967667972/tmp/abi-0.7.11pre9/src'
make[1]: *** [compile] Error 2
make[1]: Leaving directory `/space/builds/0967667972/tmp/abi-0.7.11pre9'
compile ended at Wed Aug 30 15:49:54 CDT 2000
RESULT: Build failed

This archive was generated by hypermail 2b25 : Wed Aug 30 2000 - 16:02:41 CDT